Reaction Details
TargetTyrosine-protein kinase transforming protein Abl
LigandBDBM50292484
Substrate/Competitorn/a
Meas. Tech.ChEBML_221795
IC50 44000±n/a nM
Citation Kruse, CHHolden, KGOffen, PHPritchard, MLFeild, JARieman, DJBender, PEFerguson, BGreig, RGPoste, G Synthesis and evaluation of multisubstrate inhibitors of an oncogene-encoded tyrosine-specific protein kinase. 2. J Med Chem31:1768-72 (1988) Tyrosine-protein kinase transforming protein Abl
Name:Tyrosine-protein kinase transforming protein Abl
Type:Enzyme
Mol. Mass.:81895.89
Organism:Abelson murine leukemia virus
Description:P00521
Residue:746
BDBM50292484
NameBDBM50292484
Synonyms:CHEMBL509039 | {[(2R,3S,4R,5R)-5-(6-amino-9H-purin-9-yl)-3,4-dihydroxyoxolan-2-yl]methoxy}({[({[4-(2-carbamoyl-2-acetamidoethyl)phenyl]amino}(hydroxy)phosphoryl)oxy](hydroxy)phosphoryl}oxy)phosphinic acid
TypeSmall organic molecule
Emp. Form.C21H29N8O14P3
Mol. Mass.710.4214
SMILESCC(=O)NC(Cc1ccc(NP(O)(=O)OP(O)(=O)OP(O)(=O)OC[C@H]2O[C@H]([C@H](O)[C@@H]2O)n2cnc3c(N)ncnc23)cc1)C(N)=O