Reaction Details
TargetTyrosine-protein kinase transforming protein Abl
LigandBDBM50292483
Substrate/Competitorn/a
Meas. Tech.ChEBML_221795
IC50 41000±n/a nM
Citation Kruse, CHHolden, KGOffen, PHPritchard, MLFeild, JARieman, DJBender, PEFerguson, BGreig, RGPoste, G Synthesis and evaluation of multisubstrate inhibitors of an oncogene-encoded tyrosine-specific protein kinase. 2. J Med Chem31:1768-72 (1988) Tyrosine-protein kinase transforming protein Abl
Name:Tyrosine-protein kinase transforming protein Abl
Type:Enzyme
Mol. Mass.:81895.89
Organism:Abelson murine leukemia virus
Description:P00521
Residue:746
BDBM50292483
NameBDBM50292483
Synonyms:CHEMBL520527 | {[(2R,3S,4R,5R)-5-(6-amino-9H-purin-9-yl)-3,4-dihydroxyoxolan-2-yl]methoxy}({[hydroxy({[hydroxy({[hydroxy(phenoxy)phosphoryl]oxy})phosphoryl]oxy})phosphoryl]oxy})phosphinic acid
TypeSmall organic molecule
Emp. Form.C16H21N5O16P4
Mol. Mass.663.2569
SMILESNc1ncnc2n(cnc12)[C@@H]1O[C@H](COP(O)(=O)OP(O)(=O)OP(O)(=O)OP(O)(=O)Oc2ccccc2)[C@@H](O)[C@H]1O