Reaction Details
TargetTyrosine-protein kinase transforming protein Abl
LigandBDBM50292482
Substrate/Competitorn/a
Meas. Tech.ChEBML_221795
IC50 25000±n/a nM
Citation Kruse, CHHolden, KGOffen, PHPritchard, MLFeild, JARieman, DJBender, PEFerguson, BGreig, RGPoste, G Synthesis and evaluation of multisubstrate inhibitors of an oncogene-encoded tyrosine-specific protein kinase. 2. J Med Chem31:1768-72 (1988) Tyrosine-protein kinase transforming protein Abl
Name:Tyrosine-protein kinase transforming protein Abl
Type:Enzyme
Mol. Mass.:81895.89
Organism:Abelson murine leukemia virus
Description:P00521
Residue:746
BDBM50292482
NameBDBM50292482
Synonyms:({[({[(2R,3S,4R,5R)-5-(6-amino-9H-purin-9-yl)-3,4-dihydroxyoxolan-2-yl]methoxy}(hydroxy)phosphoryl)oxy](hydroxy)phosphoryl}oxy)[(2-acetamidoethyl)amino]phosphinic acid | CHEMBL520671
TypeSmall organic molecule
Emp. Form.C14H24N7O13P3
Mol. Mass.591.3007
SMILESCC(=O)NCCNP(O)(=O)OP(O)(=O)OP(O)(=O)OC[C@H]1O[C@H]([C@H](O)[C@@H]1O)n1cnc2c(N)ncnc12