Reaction Details
TargetPotassium-transporting ATPase alpha chain 1/subunit beta
LigandBDBM50367790
Substrate/Competitorn/a
Meas. Tech.ChEMBL_164920 (CHEMBL770631)
IC50 80±n/a nM
Citation Sanfilippo, PJUrbanski, MPress, JBHajos, ZGShriver, DAScott, CK Synthesis of (aryloxy)alkylamines. 1. Novel antisecretory agents with H+K+-ATPase inhibitory activity. J Med Chem31:1778-85 (1988) Potassium-transporting ATPase alpha chain 1/subunit beta
Name:Potassium-transporting ATPase alpha chain 1/subunit beta
Type:n/a
Mol. Mass.:n/a
Description:ASSAY_ID of EBI is 71495
Components:This complex has 2 components.
Component 1
Name:Potassium-transporting ATPase alpha chain 1
Synonyms:ATP4A Gastric H(+)/K(+) ATPase subunit alpha Potassium-transporting ATPase alpha chain 1 | Proton pump
Type:PROTEIN
Mol. Mass.:114109.05
Organism:Homo sapiens (Human)
Description:EBI_82
Residue:1035
Component 2
Name:Potassium-transporting ATPase subunit beta
Synonyms:ATP4B Gastric H(+)/K(+) ATPase subunit beta Potassium-transporting ATPase subunit beta | Proton pump beta chain
Type:PROTEIN
Mol. Mass.:33369.83
Organism:Homo sapiens (Human)
Description:EBI_10719
Residue:291
BDBM50367790
NameBDBM50367790
Synonyms:CHEMBL1202681
TypeSmall organic molecule
Emp. Form.C23H28N2O2
Mol. Mass.364.4806
SMILESCCN(CC)CCCCOc1ccc(\C=C\c2nc3ccccc3o2)cc1