Reaction Details
TargetIndolethylamine N-methyltransferase
LigandBDBM50367839
Substrate/Competitorn/a
Meas. Tech.ChEBML_89038
Ki 12000±n/a nM
Citation Broom, AD Rational design of enzyme inhibitors: multisubstrate analogue inhibitors. J Med Chem32:2-7 (1989) Indolethylamine N-methyltransferase
Name:Indolethylamine N-methyltransferase
Type:PROTEIN
Mol. Mass.:28884.19
Organism:Homo sapiens (Human)
Description:ChEMBL_1333668
Residue:263
BDBM50367839
NameBDBM50367839
Synonyms:CHEMBL2368635
TypeSmall organic molecule
Emp. Form.C23H29IN6O3S
Mol. Mass.596.484
SMILES[I-].C[S+](CCCCc1c[nH]c2ccccc12)C[C@H]1O[C@H]([C@H](O)[C@@H]1O)n1cnc2c(N)ncnc12