Reaction Details
TargetD(2) dopamine receptor
LigandBDBM50017519
Substrate/Competitorn/a
Meas. Tech.ChEMBL_61439 (CHEMBL671412)
IC50 4±n/a nM
Citation Wikström, HAndersson, BSvensson, AHumber, LGAsselin, AASvensson, KEkman, ACarlsson, ANilsson, IChidester, C Resolved 6,7,8,9-tetrahydro-N,N-dimethyl-3H-benz[e]indol-8-amine: central dopamine and serotonin receptor stimulating properties. J Med Chem32:2273-6 (1989) D(2) dopamine receptor
Name:D(2) dopamine receptor
Type:G Protein-Coupled Receptor (GPCR)
Mol. Mass.:50931.60
Organism:Rattus norvegicus (rat)
Description:P61169
Residue:444
BDBM50017519
NameBDBM50017519
Synonyms:1,1-Diethyl-3-(7-methyl-4,6,6a,7,8,9,10,10a-octahydro-indolo[4,3-fg]quinolin-9-yl)-urea Terguride
TypeSmall organic molecule
Emp. Form.C20H28N4O
Mol. Mass.340.4625
SMILESCCN(CC)C(=O)N[C@H]1C[C@H]2[C@@H](Cc3c[nH]c4cccc2c34)N(C)C1