Reaction Details
TargetPhenylethanolamine N-methyltransferase
LigandBDBM10758
Substrate/Competitorn/a
Meas. Tech.ChEBML_152563
Ki 854000±n/a nM
Citation Ye, QHGrunewald, GL Conformationally restricted and conformationally defined tyramine analogues as inhibitors of phenylethanolamine N-methyltransferase. J Med Chem32:478-86 (1989) Phenylethanolamine N-methyltransferase
Name:Phenylethanolamine N-methyltransferase
Type:Enzyme
Mol. Mass.:30916.97
Organism:Bos taurus (bovine)
Description:n/a
Residue:283
BDBM10758
NameBDBM10758
Synonyms:14C-phenylethylamine CHEMBL610 | phenylethylamine
TypeSmall organic molecule
Emp. Form.C8H11N
Mol. Mass.121.1796
SMILESNCCc1ccccc1