Reaction Details
Target5-hydroxytryptamine receptor 1B
LigandBDBM50016912
Substrate/Competitorn/a
Meas. Tech.ChEBML_3978
Ki 1000±n/a nM
Citation Pierson, MELyon, RATiteler, MSchulman, SBKowalski, PGlennon, RA Design and synthesis of propranolol analogues as serotonergic agents. J Med Chem32:859-63 (1989) 5-hydroxytryptamine receptor 1B
Name:5-hydroxytryptamine receptor 1B
Type:Protein
Mol. Mass.:43173.33
Organism:Rattus norvegicus (Rat)
Description:P28564
Residue:386
BDBM50016912
NameBDBM50016912
Synonyms:CHEMBL138136 | Dimethyl-[3-(naphthalen-1-yloxy)-propyl]-amine
TypeSmall organic molecule
Emp. Form.C15H19NO
Mol. Mass.229.3175
SMILESCN(C)CCCOc1cccc2ccccc12