Reaction Details
Target5-hydroxytryptamine receptor 1A
LigandBDBM36108
Substrate/Competitorn/a
Meas. Tech.ChEBML_3977
Ki 1700±n/a nM
Citation Pierson, MELyon, RATiteler, MSchulman, SBKowalski, PGlennon, RA Design and synthesis of propranolol analogues as serotonergic agents. J Med Chem32:859-63 (1989) 5-hydroxytryptamine receptor 1A
Name:5-hydroxytryptamine receptor 1A
Type:G Protein-Coupled Receptor (GPCR)
Mol. Mass.:46445.29
Organism:Rattus norvegicus (rat)
Description:Binding assays were performed using rat hippocampal membranes.
Residue:422
BDBM36108
NameBDBM36108
Synonyms:(R)-propranolol
TypeGuest
Emp. Form.C16H22NO2
Mol. Mass.260.3508
SMILESCC(C)[NH2+]C[C@@H](O)COc1cccc2ccccc12