Reaction Details
Target5-hydroxytryptamine receptor 1A
LigandBDBM50016912
Substrate/Competitorn/a
Meas. Tech.ChEBML_3977
Ki 345±n/a nM
Citation Pierson, MELyon, RATiteler, MSchulman, SBKowalski, PGlennon, RA Design and synthesis of propranolol analogues as serotonergic agents. J Med Chem32:859-63 (1989) 5-hydroxytryptamine receptor 1A
Name:5-hydroxytryptamine receptor 1A
Type:G Protein-Coupled Receptor (GPCR)
Mol. Mass.:46445.29
Organism:Rattus norvegicus (rat)
Description:Binding assays were performed using rat hippocampal membranes.
Residue:422
BDBM50016912
NameBDBM50016912
Synonyms:CHEMBL138136 | Dimethyl-[3-(naphthalen-1-yloxy)-propyl]-amine
TypeSmall organic molecule
Emp. Form.C15H19NO
Mol. Mass.229.3175
SMILESCN(C)CCCOc1cccc2ccccc12