Reaction Details
TargetAdenosine receptor A2a/A2b
LigandBDBM50017991
Substrate/Competitorn/a
Meas. Tech.ChEMBL_30865 (CHEMBL646362)
Ki 207±n/a nM
Citation Jacobson, KABarone, SKammula, UStiles, GL Electrophilic derivatives of purines as irreversible inhibitors of A1 adenosine receptors. J Med Chem32:1043-51 (1989) Adenosine receptor A2a/A2b
Name:Adenosine receptor A2a/A2b
Synonyms:Adenosine A2 receptor
Type:n/a
Mol. Mass.:n/a
Description:ASSAY_ID of ChEMBL is 30560
Components:This complex has 2 components.
Component 1
Name:Adenosine receptor A2b
Type:PROTEIN
Mol. Mass.:36378.84
Organism:Rattus norvegicus
Description:ChEMBL_32934
Residue:332
Component 2
Name:Adenosine receptor A2a
Synonyms:AA2AR_RAT Adenosine A2 receptor Adenosine Receptors A2a (A2a) Adenosine receptors A2a Rat striatal adenosine A2a receptor
Type:G Protein-Coupled Receptor (GPCR)
Mol. Mass.:45015.65
Organism:Rattus norvegicus (rat)
Description:Rat A2A receptors expressed in CHO cells.
Residue:410
BDBM50017991
NameBDBM50017991
Synonyms:7-(2-{2-[4-(2,6-Dioxo-1,3-dipropyl-2,3,6,7-tetrahydro-1H-purin-8-yl)-phenoxy]-acetylamino}-ethylcarbamoyl)-heptanoic acid 2,5-dioxo-pyrrolidin-1-yl ester | CHEMBL8969
TypeSmall organic molecule
Emp. Form.C33H43N7O9
Mol. Mass.681.736
SMILESCCCn1c2nc([nH]c2c(=O)n(CCC)c1=O)-c1ccc(OCC(=O)NCCNC(=O)CCCCCCC(=O)ON2C(=O)CCC2=O)cc1