Reaction Details
TargetAdenosine receptor A1
LigandBDBM50367862
Substrate/Competitorn/a
Meas. Tech.ChEBML_28977
Ki 1.2±n/a nM
Citation Jacobson, KABarone, SKammula, UStiles, GL Electrophilic derivatives of purines as irreversible inhibitors of A1 adenosine receptors. J Med Chem32:1043-51 (1989) Adenosine receptor A1
Name:Adenosine receptor A1
Type:Protein
Mol. Mass.:36704.13
Organism:Rattus norvegicus (rat)
Description:n/a
Residue:326
BDBM50367862
NameBDBM50367862
Synonyms:CHEMBL604353
TypeSmall organic molecule
Emp. Form.C35H36BrN9O6S
Mol. Mass.790.686
SMILESOC[C@H]1OC([C@H](O)[C@@H]1O)n1cnc2c(Nc3ccc(CC(=O)Nc4ccc(CC(=O)NCCNC(=S)Nc5ccc(Br)cc5)cc4)cc3)ncnc12