Reaction Details
TargetLeucyl-cystinyl aminopeptidase
LigandBDBM50017480
Substrate/Competitorn/a
Meas. Tech.ChEMBL_98526 (CHEMBL706546)
Ki>297000±n/a nM
Citation Harbeson, SLRich, DH Inhibition of aminopeptidases by peptides containing ketomethylene and hydroxyethylene amide bond replacements. J Med Chem32:1378-92 (1989) Leucyl-cystinyl aminopeptidase
Name:Leucyl-cystinyl aminopeptidase
Type:PROTEIN
Mol. Mass.:117179.39
Organism:Rattus norvegicus
Description:ChEMBL_98523
Residue:1025
BDBM50017480
NameBDBM50017480
Synonyms:5-Amino-8-guanidino-2-(4-hydroxy-benzyl)-4-oxo-octanoic acid | CHEMBL281437
TypeSmall organic molecule
Emp. Form.C16H24N4O4
Mol. Mass.336.3862
SMILESN[C@@H](CCCNC(N)=N)C(=O)C[C@@H](Cc1ccc(O)cc1)C(O)=O