Reaction Details
TargetAminopeptidase B
LigandBDBM50017479
Substrate/Competitorn/a
Meas. Tech.ChEMBL_35353 (CHEMBL647935)
Ki 2800±n/a nM
Citation Harbeson, SLRich, DH Inhibition of aminopeptidases by peptides containing ketomethylene and hydroxyethylene amide bond replacements. J Med Chem32:1378-92 (1989) Aminopeptidase B
Name:Aminopeptidase B
Type:PROTEIN
Mol. Mass.:72609.93
Organism:Rattus norvegicus
Description:ChEMBL_1344423
Residue:650
BDBM50017479
NameBDBM50017479
Synonyms:2-(5,9-Diamino-2-methyl-4-oxo-nonanoylamino)-3-phenyl-propionic acid | CHEMBL28708
TypeSmall organic molecule
Emp. Form.C19H29N3O4
Mol. Mass.363.4513
SMILESCC(CC(=O)[C@@H](N)CCCCN)C(=O)NC(Cc1ccccc1)C(O)=O