Reaction Details
TargetAminopeptidase B
LigandBDBM50017473
Substrate/Competitorn/a
Meas. Tech.ChEBML_35354
Ki 130000±n/a nM
Citation Harbeson, SLRich, DH Inhibition of aminopeptidases by peptides containing ketomethylene and hydroxyethylene amide bond replacements. J Med Chem32:1378-92 (1989) Aminopeptidase B
Name:Aminopeptidase B
Type:PROTEIN
Mol. Mass.:72609.93
Organism:Rattus norvegicus
Description:ChEMBL_1344423
Residue:650
BDBM50017473
NameBDBM50017473
Synonyms:5-Amino-2,7-dimethyl-4-oxo-octanoic acid | CHEMBL27690
TypeSmall organic molecule
Emp. Form.C10H19NO3
Mol. Mass.201.2628
SMILESCC(C)CC(N)C(=O)CC(C)C(O)=O