Reaction Details
TargetAminopeptidase B
LigandBDBM50017483
Substrate/Competitorn/a
Meas. Tech.ChEBML_35354
Ki 36000±n/a nM
Citation Harbeson, SLRich, DH Inhibition of aminopeptidases by peptides containing ketomethylene and hydroxyethylene amide bond replacements. J Med Chem32:1378-92 (1989) Aminopeptidase B
Name:Aminopeptidase B
Type:PROTEIN
Mol. Mass.:72609.93
Organism:Rattus norvegicus
Description:ChEMBL_1344423
Residue:650
BDBM50017483
NameBDBM50017483
Synonyms:5-Amino-2-benzyl-7-methyl-4-oxo-octanoic acid [2-methyl-1-(3-methyl-butylcarbamoyl)-propyl]-amide | CHEMBL284228
TypeSmall organic molecule
Emp. Form.C26H43N3O3
Mol. Mass.445.6379
SMILESCC(C)CCNC(=O)[C@@H](NC(=O)[C@H](CC(=O)[C@@H](N)CC(C)C)Cc1ccccc1)C(C)C