Reaction Details
TargetAminopeptidase B
LigandBDBM50017482
Substrate/Competitorn/a
Meas. Tech.ChEMBL_35351 (CHEMBL647933)
Ki 2.5±n/a nM
Citation Harbeson, SLRich, DH Inhibition of aminopeptidases by peptides containing ketomethylene and hydroxyethylene amide bond replacements. J Med Chem32:1378-92 (1989) Aminopeptidase B
Name:Aminopeptidase B
Type:PROTEIN
Mol. Mass.:72609.93
Organism:Rattus norvegicus
Description:ChEMBL_1344423
Residue:650
BDBM50017482
NameBDBM50017482
Synonyms:5-Amino-2-benzyl-8-guanidino-4-oxo-octanoic acid | CHEMBL282583
TypeSmall organic molecule
Emp. Form.C16H24N4O3
Mol. Mass.320.3868
SMILESN[C@@H](CCCNC(N)=N)C(=O)C[C@@H](Cc1ccccc1)C(O)=O