Reaction Details
TargetAminopeptidase B
LigandBDBM50405948
Substrate/Competitorn/a
Meas. Tech.ChEBML_35354
Ki 770±n/a nM
Citation Harbeson, SLRich, DH Inhibition of aminopeptidases by peptides containing ketomethylene and hydroxyethylene amide bond replacements. J Med Chem32:1378-92 (1989) Aminopeptidase B
Name:Aminopeptidase B
Type:PROTEIN
Mol. Mass.:72609.93
Organism:Rattus norvegicus
Description:ChEMBL_1344423
Residue:650
BDBM50405948
NameBDBM50405948
Synonyms:CHEMBL2114365
TypeSmall organic molecule
Emp. Form.C16H23NO3
Mol. Mass.277.3587
SMILESCC(C)C[C@@H](N)C(=O)CC(Cc1ccccc1)C(O)=O