Reaction Details
TargetAdenosine receptor A1
LigandBDBM50017991
Substrate/Competitorn/a
Meas. Tech.ChEBML_29628
Ki 3.7±n/a nM
Citation Jacobson, KAKiriasis, LBarone, SBradbury, BJKammula, UCampagne, JMSecunda, SDaly, JWNeumeyer, JLPfleiderer, W Sulfur-containing 1,3-dialkylxanthine derivatives as selective antagonists at A1-adenosine receptors. J Med Chem32:1873-9 (1989) Adenosine receptor A1
Name:Adenosine receptor A1
Type:Protein
Mol. Mass.:36704.13
Organism:Rattus norvegicus (rat)
Description:n/a
Residue:326
BDBM50017991
NameBDBM50017991
Synonyms:7-(2-{2-[4-(2,6-Dioxo-1,3-dipropyl-2,3,6,7-tetrahydro-1H-purin-8-yl)-phenoxy]-acetylamino}-ethylcarbamoyl)-heptanoic acid 2,5-dioxo-pyrrolidin-1-yl ester | CHEMBL8969
TypeSmall organic molecule
Emp. Form.C33H43N7O9
Mol. Mass.681.736
SMILESCCCn1c2nc([nH]c2c(=O)n(CCC)c1=O)-c1ccc(OCC(=O)NCCNC(=O)CCCCCCC(=O)ON2C(=O)CCC2=O)cc1