Reaction Details
TargetD(2) dopamine receptor
LigandBDBM50017513
Substrate/Competitorn/a
Meas. Tech.ChEBML_62238
Ki 770±n/a nM
Citation Cannon, JGJackson, HLong, JPLeonard, PBhatnagar, RK 5-HT1A-receptor antagonism: N-alkyl derivatives of (R)-(-)-8,11-dimethoxynoraporphine. J Med Chem32:1959-62 (1989) D(2) dopamine receptor
Name:D(2) dopamine receptor
Type:G Protein-Coupled Receptor (GPCR)
Mol. Mass.:50931.60
Organism:Rattus norvegicus (rat)
Description:P61169
Residue:444
BDBM50017513
NameBDBM50017513
Synonyms:8,11-Dimethoxy-6-propyl-5,6,6a,7-tetrahydro-4H-dibenzo[de,g]quinoline | CHEMBL61377
TypeSmall organic molecule
Emp. Form.C21H25NO2
Mol. Mass.323.4287
SMILESCCCN1CCc2cccc-3c2[C@H]1Cc1c(OC)ccc(OC)c-31