Reaction Details
TargetKappa-type opioid receptor
LigandBDBM50000780
Substrate/Competitorn/a
Meas. Tech.ChEBML_146532
Ki 0.890000±n/a nM
Citation de Costa, BRBowen, WDHellewell, SBGeorge, CRothman, RBReid, AAWalker, JMJacobson, AERice, KC Alterations in the stereochemistry of the kappa-selective opioid agonist U50,488 result in high-affinity sigma ligands. J Med Chem32:1996-2002 (1989) Kappa-type opioid receptor
Name:Kappa-type opioid receptor
Type:G Protein-Coupled Receptor (GPCR)
Mol. Mass.:42744.99
Organism:Cavia porcellus (domestic guinea pig)
Description:P41144
Residue:380
BDBM50000780
NameBDBM50000780
Synonyms:2-(3,4-Dichloro-phenyl)-N-methyl-N-(2-pyrrolidin-1-yl-cyclohexyl)-acetamide CHEMBL593781
TypeSmall organic molecule
Emp. Form.C19H26Cl2N2O
Mol. Mass.369.329
SMILESCN([C@H]1CCCC[C@@H]1N1CCCC1)C(=O)Cc1ccc(Cl)c(Cl)c1