Reaction Details
TargetAmine oxidase [flavin-containing] A
LigandBDBM13016
Substrate/Competitorn/a
Meas. Tech.ChEBML_122785
Ki 210000±n/a nM
Citation Bembenek, MEAbell, CWChrisey, LARozwadowska, MDGessner, WBrossi, A Inhibition of monoamine oxidases A and B by simple isoquinoline alkaloids: racemic and optically active 1,2,3,4-tetrahydro-, 3,4-dihydro-, and fully aromatic isoquinolines. J Med Chem33:147-52 (1990) Amine oxidase [flavin-containing] A
Name:Amine oxidase [flavin-containing] A
Type:Protein
Mol. Mass.:59689.53
Organism:Homo sapiens (Human)
Description:P21397
Residue:527
BDBM13016
NameBDBM13016
Synonyms:1,2,3,4-tetrahydroisoquinoline THIQ 6 | tetrahydroisoquinoline
TypeSmall organic molecule
Emp. Form.C9H11N
Mol. Mass.133.1903
SMILESC1Cc2ccccc2CN1