Reaction Details
TargetD(2) dopamine receptor
LigandBDBM50012965
Substrate/Competitorn/a
Meas. Tech.ChEMBL_63030 (CHEMBL678176)
Ki 0.230000±n/a nM
Citation Murphy, RAKung, HFKung, MPBillings, J Synthesis and characterization of iodobenzamide analogues: potential D-2 dopamine receptor imaging agents. J Med Chem33:171-8 (1990) D(2) dopamine receptor
Name:D(2) dopamine receptor
Type:G Protein-Coupled Receptor (GPCR)
Mol. Mass.:50931.60
Organism:Rattus norvegicus (rat)
Description:P61169
Residue:444
BDBM50012965
NameBDBM50012965
Synonyms:5-Iodo-2,3-dihydro-benzofuran-7-carboxylic acid (1-ethyl-pyrrolidin-2-ylmethyl)-amide ((S)-(-)IBF) CHEMBL48450
TypeSmall organic molecule
Emp. Form.C16H21IN2O2
Mol. Mass.400.2546
SMILESCCN1CCC[C@H]1CNC(=O)c1cc(I)cc2CCOc12