Reaction Details
TargetD(2) dopamine receptor
LigandBDBM50366495
Substrate/Competitorn/a
Meas. Tech.ChEMBL_62898 (CHEMBL676137)
Ki 1.2±n/a nM
Citation Murphy, RAKung, HFKung, MPBillings, J Synthesis and characterization of iodobenzamide analogues: potential D-2 dopamine receptor imaging agents. J Med Chem33:171-8 (1990) D(2) dopamine receptor
Name:D(2) dopamine receptor
Type:G Protein-Coupled Receptor (GPCR)
Mol. Mass.:50931.60
Organism:Rattus norvegicus (rat)
Description:P61169
Residue:444
BDBM50366495
NameBDBM50366495
Synonyms:(+)butaclamol | CHEMBL1255588
TypeSmall organic molecule
Emp. Form.C25H31NO
Mol. Mass.361.5197
SMILESCC(C)(C)[C@@]1(O)CCN2C[C@@H]3c4ccccc4CCc4cccc([C@H]2C1)c34