Reaction Details
TargetInterstitial collagenase
LigandBDBM50367922
Substrate/Competitorn/a
Meas. Tech.ChEBML_49509
pH7.5±n/a
Ki 50000±n/a nM
Commentsextracted
Citation Kortylewicz, ZPGalardy, RE Phosphoramidate peptide inhibitors of human skin fibroblast collagenase. J Med Chem33:263-73 (1990) Interstitial collagenase
Name:Interstitial collagenase
Type:Enzyme
Mol. Mass.:54010.26
Organism:Homo sapiens (Human)
Description: P03956
Residue:469
BDBM50367922
NameBDBM50367922
Synonyms:CHEMBL1744412
TypeSmall organic molecule
Emp. Form.C27H42N5O11P
Mol. Mass.643.6241
SMILESCCOP(O)(=O)N[C@@H]([C@@H](C)CC)C(=O)NC(Cc1ccc(OCC(=O)NC(CCCCN)C([O-])=O)cc1)C(=O)NCC([O-])=O