Reaction Details
TargetInterstitial collagenase
LigandBDBM50367926
Substrate/Competitorn/a
Meas. Tech.ChEBML_49509
pH7.5±n/a
Ki 13000±n/a nM
Commentsextracted
Citation Kortylewicz, ZPGalardy, RE Phosphoramidate peptide inhibitors of human skin fibroblast collagenase. J Med Chem33:263-73 (1990) Interstitial collagenase
Name:Interstitial collagenase
Type:Enzyme
Mol. Mass.:54010.26
Organism:Homo sapiens (Human)
Description: P03956
Residue:469
BDBM50367926
NameBDBM50367926
Synonyms:CHEMBL2369487
TypeSmall organic molecule
Emp. Form.C21H29K2N4O7P
Mol. Mass.558.6479
SMILES[K+].[K+].CCOP([O-])(=O)N[C@@H]([C@@H](C)CC)C(=O)N[C@@H](Cc1c[nH]c2ccccc12)C(=O)NCC([O-])=O