Reaction Details
TargetInterstitial collagenase
LigandBDBM50013131
Substrate/Competitorn/a
Meas. Tech.ChEBML_49509
pH7.5±n/a
Ki 403000±n/a nM
Commentsextracted
Citation Kortylewicz, ZPGalardy, RE Phosphoramidate peptide inhibitors of human skin fibroblast collagenase. J Med Chem33:263-73 (1990) Interstitial collagenase
Name:Interstitial collagenase
Type:Enzyme
Mol. Mass.:54010.26
Organism:Homo sapiens (Human)
Description: P03956
Residue:469
BDBM50013131
NameBDBM50013131
Synonyms:N-(Ethylphosphoryl)-L-isoleucyl-L-alanyl glycine-Glu-Arg-Gly
TypeSmall organic molecule
Emp. Form.C26H47N9O12P
Mol. Mass.708.6788
SMILESCCOP([O-])(=O)N[C@@H]([C@@H](C)CC)C(=O)N[C@@H](C)C(=O)NCC(=O)N[C@@H](CCC(O)=O)C(=O)N[C@@H](CCCNC(N)=N)C(=O)NCC(O)=O