Reaction Details
TargetInterstitial collagenase
LigandBDBM50367930
Substrate/Competitorn/a
Meas. Tech.ChEBML_49509
pH7.5±n/a
Ki 130000±n/a nM
Commentsextracted
Citation Kortylewicz, ZPGalardy, RE Phosphoramidate peptide inhibitors of human skin fibroblast collagenase. J Med Chem33:263-73 (1990) Interstitial collagenase
Name:Interstitial collagenase
Type:Enzyme
Mol. Mass.:54010.26
Organism:Homo sapiens (Human)
Description: P03956
Residue:469
BDBM50367930
NameBDBM50367930
Synonyms:CHEMBL2369488
TypeSmall organic molecule
Emp. Form.C13H24K2N3O7P
Mol. Mass.443.5159
SMILES[K+].[K+].CCOP([O-])(=O)N[C@@H]([C@@H](C)CC)C(=O)N[C@@H](C)C(=O)NCC([O-])=O