Reaction Details
TargetSodium-dependent noradrenaline transporter
LigandBDBM50014236
Substrate/Competitorn/a
Meas. Tech.ChEBML_131452
Ki 6±n/a nM
Citation Maryanoff, BEVaught, JLShank, RPMcComsey, DFCostanzo, MJNortey, SO Pyrroloisoquinoline antidepressants. 3. A focus on serotonin. J Med Chem33:2793-7 (1990) Sodium-dependent noradrenaline transporter
Name:Sodium-dependent noradrenaline transporter
Type:Enzyme Catalytic Domain
Mol. Mass.:69260.85
Organism:MOUSE
Description:Norepinephrine transporter 0 MOUSE::O55192
Residue:617
BDBM50014236
NameBDBM50014236
Synonyms:6-(4-Ethylsulfanyl-phenyl)-1,2,3,5,6,10b-hexahydro-pyrrolo[2,1-a]isoquinoline; hydrobromide | CHEMBL539803
TypeSmall organic molecule
Emp. Form.C20H23NS
Mol. Mass.309.468
SMILESCCSc1ccc(cc1)C1CN2CCCC2c2ccccc12