Reaction Details
TargetSodium-dependent dopamine transporter
LigandBDBM50014230
Substrate/Competitorn/a
Meas. Tech.ChEBML_131451
Ki 29±n/a nM
Citation Maryanoff, BEVaught, JLShank, RPMcComsey, DFCostanzo, MJNortey, SO Pyrroloisoquinoline antidepressants. 3. A focus on serotonin. J Med Chem33:2793-7 (1990) Sodium-dependent dopamine transporter
Name:Sodium-dependent dopamine transporter
Type:Enzyme Catalytic Domain
Mol. Mass.:68809.06
Organism:MOUSE
Description:Dopamine Transporter SLC6A3 MOUSE::Q61327
Residue:619
BDBM50014230
NameBDBM50014230
Synonyms:6-(4-Methanesulfonyl-phenyl)-1,2,3,5,6,10b-hexahydro-pyrrolo[2,1-a]isoquinoline | CHEMBL93035
TypeSmall organic molecule
Emp. Form.C19H21NO2S
Mol. Mass.327.441
SMILESCS(=O)(=O)c1ccc(cc1)C1CN2CCCC2c2ccccc12