Reaction Details
TargetSodium-dependent noradrenaline transporter
LigandBDBM50014233
Substrate/Competitorn/a
Meas. Tech.ChEBML_131452
Ki 1.6±n/a nM
Citation Maryanoff, BEVaught, JLShank, RPMcComsey, DFCostanzo, MJNortey, SO Pyrroloisoquinoline antidepressants. 3. A focus on serotonin. J Med Chem33:2793-7 (1990) Sodium-dependent noradrenaline transporter
Name:Sodium-dependent noradrenaline transporter
Type:Enzyme Catalytic Domain
Mol. Mass.:69260.85
Organism:MOUSE
Description:Norepinephrine transporter 0 MOUSE::O55192
Residue:617
BDBM50014233
NameBDBM50014233
Synonyms:6-(2-Chloro-phenyl)-1,2,3,5,6,10b-hexahydro-pyrrolo[2,1-a]isoquinoline | CHEMBL94535
TypeSmall organic molecule
Emp. Form.C18H18ClN
Mol. Mass.283.795
SMILESClc1ccccc1C1CN2CCC[C@@H]2c2ccccc12