Reaction Details
TargetSodium-dependent noradrenaline transporter
LigandBDBM50014231
Substrate/Competitorn/a
Meas. Tech.ChEBML_131452
Ki 17±n/a nM
Citation Maryanoff, BEVaught, JLShank, RPMcComsey, DFCostanzo, MJNortey, SO Pyrroloisoquinoline antidepressants. 3. A focus on serotonin. J Med Chem33:2793-7 (1990) Sodium-dependent noradrenaline transporter
Name:Sodium-dependent noradrenaline transporter
Type:Enzyme Catalytic Domain
Mol. Mass.:69260.85
Organism:MOUSE
Description:Norepinephrine transporter 0 MOUSE::O55192
Residue:617
BDBM50014231
NameBDBM50014231
Synonyms:6-(2,4-Dichloro-phenyl)-1,2,3,5,6,10b-hexahydro-pyrrolo[2,1-a]isoquinoline | CHEMBL94508
TypeSmall organic molecule
Emp. Form.C18H17Cl2N
Mol. Mass.318.24
SMILESClc1ccc(C2CN3CCCC3c3ccccc23)c(Cl)c1