Reaction Details
TargetSodium-dependent noradrenaline transporter
LigandBDBM50014237
Substrate/Competitorn/a
Meas. Tech.ChEMBL_131452 (CHEMBL740207)
Ki 2.90±n/a nM
Citation Maryanoff, BEVaught, JLShank, RPMcComsey, DFCostanzo, MJNortey, SO Pyrroloisoquinoline antidepressants. 3. A focus on serotonin. J Med Chem33:2793-7 (1990) Sodium-dependent noradrenaline transporter
Name:Sodium-dependent noradrenaline transporter
Type:Enzyme Catalytic Domain
Mol. Mass.:69260.85
Organism:MOUSE
Description:Norepinephrine transporter 0 MOUSE::O55192
Residue:617
BDBM50014237
NameBDBM50014237
Synonyms:6-(4-Methylsulfanyl-phenyl)-1,2,3,5,6,10b-hexahydro-pyrrolo[2,1-a]isoquinoline | CHEMBL327790
TypeSmall organic molecule
Emp. Form.C19H21NS
Mol. Mass.295.442
SMILESCSc1ccc(cc1)C1CN2CCC[C@@H]2c2ccccc12