Reaction Details
TargetSodium-dependent dopamine transporter
LigandBDBM50010859
Substrate/Competitorn/a
Meas. Tech.ChEBML_131451
Ki 42±n/a nM
Citation Maryanoff, BEVaught, JLShank, RPMcComsey, DFCostanzo, MJNortey, SO Pyrroloisoquinoline antidepressants. 3. A focus on serotonin. J Med Chem33:2793-7 (1990) Sodium-dependent dopamine transporter
Name:Sodium-dependent dopamine transporter
Type:Enzyme Catalytic Domain
Mol. Mass.:68809.06
Organism:MOUSE
Description:Dopamine Transporter SLC6A3 MOUSE::Q61327
Residue:619
BDBM50010859
NameBDBM50010859
Synonyms:CHEMBL11 IMIPRAMINE PAMOATE | Imipramin
TypeSmall organic molecule
Emp. Form.C19H24N2
Mol. Mass.280.4073
SMILESCN(C)CCCN1c2ccccc2CCc2ccccc12