Reaction Details
TargetAromatase
LigandBDBM50014307
Substrate/Competitorn/a
Meas. Tech.ChEBML_50885
Ki 1±n/a nM
Citation Cole, PARobinson, CH Mechanism and inhibition of cytochrome P-450 aromatase. J Med Chem33:2933-42 (1990) Aromatase
Name:Aromatase
Type:Enzyme
Mol. Mass.:57888.92
Organism:Homo sapiens (Human)
Description:P11511
Residue:503
BDBM50014307
NameBDBM50014307
Synonyms:10-Difluoromethyl-13-methyl-1,6,7,8,9,10,11,12,13,14,15,16-dodecahydro-2H-cyclopenta[a]phenanthrene-3,17-dione | CHEMBL98998
TypeSmall organic molecule
Emp. Form.C19H24F2O2
Mol. Mass.322.3895
SMILESC[C@]12CCC3C(CCC4=CC(=O)CC[C@]34C(F)F)C1CCC2=O