Reaction Details
TargetAromatase
LigandBDBM50014323
Substrate/Competitorn/a
Meas. Tech.ChEBML_50885
Ki 20±n/a nM
Citation Cole, PARobinson, CH Mechanism and inhibition of cytochrome P-450 aromatase. J Med Chem33:2933-42 (1990) Aromatase
Name:Aromatase
Type:Enzyme
Mol. Mass.:57888.92
Organism:Homo sapiens (Human)
Description:P11511
Residue:503
BDBM50014323
NameBDBM50014323
Synonyms:2-PHENYL-4H-BENZO[H]CHROMEN-4-ONE 7,8-Benzoflavone alpha-naphthoflavone
TypeSmall organic molecule
Emp. Form.C19H12O2
Mol. Mass.272.2974
SMILESO=c1cc(oc2c3ccccc3ccc12)-c1ccccc1