Reaction Details
TargetSigma non-opioid intracellular receptor 1
LigandBDBM50013966
Substrate/Competitorn/a
Meas. Tech.ChEBML_201137
Ki 31±n/a nM
Citation de Costa, BRRice, KCBowen, WDThurkauf, ARothman, RBBand, LJacobson, AERadesca, LContreras, PCGray, NM Synthesis and evaluation of N-substituted cis-N-methyl-2-(1-pyrrolidinyl)cyclohexylamines as high affinity sigma receptor ligands. Identification of a new class of highly potent and selective sigma receptor probes. J Med Chem33:3100-10 (1990) Sigma non-opioid intracellular receptor 1
Name:Sigma non-opioid intracellular receptor 1
Type:Enzyme Catalytic Domain
Mol. Mass.:25124.85
Organism:Homo sapiens (Human)
Description:Q99720
Residue:223
BDBM50013966
NameBDBM50013966
Synonyms:(2-Benzo[1,3]dioxol-5-yl-ethyl)-methyl-(2-pyrrolidin-1-yl-cyclohexyl)-amine | (2R)-N-[2-(2H-1,3-benzodioxol-5-yl)ethyl]-N-methyl-2-(pyrrolidin-1-yl)cyclohexan-1-amine
TypeSmall organic molecule
Emp. Form.C20H30N2O2
Mol. Mass.330.4644
SMILESCN(CCc1ccc2OCOc2c1)C1CCCC[C@H]1N1CCCC1