Reaction Details
Target5-hydroxytryptamine receptor 3A/3B
LigandBDBM82561
Substrate/Competitorn/a
Meas. Tech.ChEMBL_3399 (CHEMBL619645)
Ki 26±n/a nM
Citation Robertson, DWBloomquist, WCohen, MLReid, LRSchenck, KWong, DT Synthesis and biochemical evaluation of tritium-labeled 1-methyl-N-(8-methyl-8-azabicyclo[3.2.1]oct-3-yl)-1H-indazole-3-carboxa mide, a useful radioligand for 5HT3 receptors. J Med Chem33:3176-81 (1991) 5-hydroxytryptamine receptor 3A/3B
Name:5-hydroxytryptamine receptor 3A/3B
Type:n/a
Mol. Mass.:n/a
Description:ASSAY_ID of EBI is 2974
Components:This complex has 2 components.
Component 1
Name:5-hydroxytryptamine receptor 3B
Synonyms:5HT3B_RAT Serotonin (5-HT) receptor
Type:PROTEIN
Mol. Mass.:50328.78
Organism:Rattus norvegicus
Description:EBI_11885
Residue:437
Component 2
Name:5-hydroxytryptamine receptor 3A
Synonyms:5-HT3 5HT3A_RAT Htr3 Serotonin (5-HT) receptor | Zacopride site-R
Type:Enzyme Catalytic Domain
Mol. Mass.:55428.70
Organism:RAT
Description:5-HT3 HTR3A RAT::P35563
Residue:483
BDBM82561
NameBDBM82561
Synonyms:CAS_40796-97-2 Tropanyl-3,5 dichlorobenzoate
TypeSmall organic molecule
Emp. Form.C15H17Cl2NO2
Mol. Mass.314.207
SMILESCN1[C@H]2CC[C@@H]1C[C@@H](C2)OC(=O)c1cc(Cl)cc(Cl)c1