Reaction Details
TargetRibonucleoside-diphosphate reductase large subunit
LigandBDBM50013363
Substrate/Competitorn/a
Meas. Tech.ChEMBL_195110 (CHEMBL795005)
IC50 48000±n/a nM
Citation Gaudreau, PParadis, HLangelier, YBrazeau, P Synthesis and inhibitory potency of peptides corresponding to the subunit 2 C-terminal region of herpes virus ribonucleotide reductases. J Med Chem33:723-30 (1990) Ribonucleoside-diphosphate reductase large subunit
Name:Ribonucleoside-diphosphate reductase large subunit
Type:PROTEIN
Mol. Mass.:124049.68
Organism:Human herpesvirus 1 (strain 17) (HHV-1) (Human herpes simplex virus1)
Description:ChEMBL_195109
Residue:1137
BDBM50013363
NameBDBM50013363
Synonyms:CHEMBL351165 | Tyr-Ala-Gly-Pro-Val-Val-Asn-Asp-Leu
TypeSmall organic molecule
Emp. Form.C43H66N10O14
Mol. Mass.947.0427
SMILESCC(C)C[C@H](NC(=O)[C@H](CC(O)=O)NC(=O)[C@H](CC(N)=O)NC(=O)[C@@H](NC(=O)[C@@H](NC(=O)[C@@H]1CCCN1C(=O)CNC(=O)[C@H](C)NC(=O)[C@@H](N)Cc1ccc(O)cc1)C(C)C)C(C)C)C(O)=O