Reaction Details
TargetDelta-type/Kappa-type/Mu-type opioid receptor
LigandBDBM50013385
Substrate/Competitorn/a
Meas. Tech.ChEMBL_149655 (CHEMBL756018)
IC50 2.4±n/a nM
Citation Olsen, LDKlein, PNelson, WLYao, YHSimon, EJ Conjugate addition ligands of opioid antagonists. Methacrylate esters and ethers of 6 alpha- and 6 beta-naltrexol. J Med Chem33:737-41 (1990) Delta-type/Kappa-type/Mu-type opioid receptor
Name:Delta-type/Kappa-type/Mu-type opioid receptor
Synonyms:Opioid receptors; mu/kappa/delta
Type:n/a
Mol. Mass.:n/a
Description:ASSAY_ID of ChEMBL is 357797
Components:This complex has 3 components.
Component 1
Name:Mu-type opioid receptor
Type:G Protein-Coupled Receptor (GPCR)
Mol. Mass.:44789.51
Organism:Homo sapiens (Human)
Description:P35372
Residue:400
Component 2
Name:Kappa-type opioid receptor
Synonyms:K-OR-1 Kappa-opioid receptor (KOR) Kappa-type opioid receptor (KOR) OPIATE Kappa OPRK1 kappa opioid receptor (KOR)
Type:G Protein-Coupled Receptor (GPCR)
Mol. Mass.:42648.76
Organism:Homo sapiens (Human)
Description:P41145
Residue:380
Component 3
Name:Delta-type opioid receptor
Synonyms:D-OR-1 Delta opioid receptor OPIATE Delta OPRD1 OPRK1 | opioid receptor, delta 1
Type:G Protein-Coupled Receptor (GPCR)
Mol. Mass.:40382.98
Organism:Homo sapiens (Human)
Description:Competition binding assays were carried out using membrane preparations from transfected HN9.10 cells that constitutively expressed the delta opioid receptor.
Residue:372
BDBM50013385
NameBDBM50013385
Synonyms:CHEMBL166355 | methyl 2-[4-cyclopropylmethyl-10,17-dihydroxy-12-oxa-4-azapentacyclo[9.6.1.01,13.05,17.07,18]octadeca-7,9,11(18)-trien-14-yloxymethyl]acrylate
TypeSmall organic molecule
Emp. Form.C25H31NO6
Mol. Mass.441.5167
SMILESCOC(=O)C(=C)COC1CCC2(O)C3Cc4ccc(O)c5OC1[C@]2(CCN3CC1CC1)c45