Reaction Details
TargetMalate dehydrogenase, cytoplasmic
LigandBDBM50421763
Substrate/Competitorn/a
Meas. Tech.ChEBML_103876
Ki 36300±n/a nM
Citation Goldstein, BMBell, JEMarquez, VE Dehydrogenase binding by tiazofurin anabolites. J Med Chem33:1123-7 (1990) Malate dehydrogenase, cytoplasmic
Name:Malate dehydrogenase, cytoplasmic
Type:Oxidoreductase; homodimer
Mol. Mass.:36453.77
Organism:Sus scrofa (pig)
Description:Porcine heart cytoplasmic fraction.
Residue:334
BDBM50421763
NameBDBM50421763
Synonyms:CHEMBL2364562
TypeSmall organic molecule
Emp. Form.C19H25N7O14P2S
Mol. Mass.669.453
SMILESNC(=O)c1csc(n1)[C@H]1O[C@@H](COP(O)(=O)OP(O)(=O)OC[C@H]2O[C@H]([C@H](O)[C@@H]2O)n2cnc3c(N)ncnc23)[C@H](O)[C@@H]1O