Reaction Details
TargetGlutamate dehydrogenase 1, mitochondrial
LigandBDBM50421763
Substrate/Competitorn/a
Meas. Tech.ChEBML_71835
Ki 4500±n/a nM
Citation Goldstein, BMBell, JEMarquez, VE Dehydrogenase binding by tiazofurin anabolites. J Med Chem33:1123-7 (1990) Glutamate dehydrogenase 1, mitochondrial
Name:Glutamate dehydrogenase 1, mitochondrial
Type:PROTEIN
Mol. Mass.:61518.81
Organism:Bos taurus
Description:ChEMBL_71835
Residue:558
BDBM50421763
NameBDBM50421763
Synonyms:CHEMBL2364562
TypeSmall organic molecule
Emp. Form.C19H25N7O14P2S
Mol. Mass.669.453
SMILESNC(=O)c1csc(n1)[C@H]1O[C@@H](COP(O)(=O)OP(O)(=O)OC[C@H]2O[C@H]([C@H](O)[C@@H]2O)n2cnc3c(N)ncnc23)[C@H](O)[C@@H]1O