Reaction Details
TargetL-lactate dehydrogenase B chain
LigandBDBM50421763
Substrate/Competitorn/a
Meas. Tech.ChEBML_96562
Ki 25200±n/a nM
Citation Goldstein, BMBell, JEMarquez, VE Dehydrogenase binding by tiazofurin anabolites. J Med Chem33:1123-7 (1990) L-lactate dehydrogenase B chain
Name:L-lactate dehydrogenase B chain
Type:PROTEIN
Mol. Mass.:36608.42
Organism:Sus scrofa
Description:ChEMBL_96562
Residue:334
BDBM50421763
NameBDBM50421763
Synonyms:CHEMBL2364562
TypeSmall organic molecule
Emp. Form.C19H25N7O14P2S
Mol. Mass.669.453
SMILESNC(=O)c1csc(n1)[C@H]1O[C@@H](COP(O)(=O)OP(O)(=O)OC[C@H]2O[C@H]([C@H](O)[C@@H]2O)n2cnc3c(N)ncnc23)[C@H](O)[C@@H]1O