Reaction Details
TargetD(2) dopamine receptor
LigandBDBM50368067
Substrate/Competitorn/a
Meas. Tech.ChEMBL_62709 (CHEMBL675802)
Ki 0.033000±n/a nM
Citation Högberg, TBengtsson, Sde Paulis, TJohansson, LStröm, PHall, HOgren, SO Potential antipsychotic agents 5. Synthesis and antidopaminergic properties of substituted 5,6-dimethoxysalicylamides and related compounds. J Med Chem33:1155-63 (1990) D(2) dopamine receptor
Name:D(2) dopamine receptor
Type:G Protein-Coupled Receptor (GPCR)
Mol. Mass.:50931.60
Organism:Rattus norvegicus (rat)
Description:P61169
Residue:444
BDBM50368067
NameBDBM50368067
Synonyms:CHEMBL1907702
TypeSmall organic molecule
Emp. Form.C18H28N2O4
Mol. Mass.336.4259
SMILESCCN1CCC[C@H]1CNC(=O)c1c(O)c(CC)cc(OC)c1OC