Reaction Details
TargetPeroxisomal N(1)-acetyl-spermine/spermidine oxidase
LigandBDBM50368113
Substrate/Competitorn/a
Meas. Tech.ChEBML_159845
Ki 2500±n/a nM
Citation Edwards, MLPrakash, NJStemerick, DMSunkara, SPBitonti, AJDavis, GFDumont, JABey, P Polyamine analogues with antitumor activity. J Med Chem33:1369-75 (1990) Peroxisomal N(1)-acetyl-spermine/spermidine oxidase
Name:Peroxisomal N(1)-acetyl-spermine/spermidine oxidase
Type:PROTEIN
Mol. Mass.:55429.08
Organism:Mus musculus
Description:ChEMBL_159845
Residue:504
BDBM50368113
NameBDBM50368113
Synonyms:CHEMBL1202500
TypeSmall organic molecule
Emp. Form.C22H42N4
Mol. Mass.362.5957
SMILESC=C=CCNCCCNCCCCCCCCNCCCNCC=C=C