Reaction Details
TargetVoltage-dependent L-type calcium channel subunit alpha-1C
LigandBDBM50226808
Substrate/Competitorn/a
Meas. Tech.ChEMBL_42758 (CHEMBL653728)
Kd 3400±n/a nM
Citation Atwal, KSRovnyak, GCSchwartz, JMoreland, SHedberg, AGougoutas, JZMalley, MFFloyd, DM Dihydropyrimidine calcium channel blockers: 2-heterosubstituted 4-aryl-1,4-dihydro-6-methyl-5-pyrimidinecarboxylic acid esters as potent mimics of dihydropyridines. J Med Chem33:1510-5 (1990) Voltage-dependent L-type calcium channel subunit alpha-1C
Name:Voltage-dependent L-type calcium channel subunit alpha-1C
Type:Enzyme Catalytic Domain
Mol. Mass.:248979.79
Organism:Homo sapiens (Human)
Description:Calcium channel (Type L) 0 HUMAN::Q13936
Residue:2221
BDBM50226808
NameBDBM50226808
Synonyms:CHEMBL3392278
TypeSmall organic molecule
Emp. Form.C16H20N4O4
Mol. Mass.332.3544
SMILESCCOC(=O)C1=C(C)NC(=NC1c1cccc(c1)[N+]([O-])=O)N(C)C