Reaction Details
TargetVoltage-dependent L-type calcium channel subunit alpha-1C
LigandBDBM50226804
Substrate/Competitorn/a
Meas. Tech.ChEMBL_42758 (CHEMBL653728)
Kd 105±n/a nM
Citation Atwal, KSRovnyak, GCSchwartz, JMoreland, SHedberg, AGougoutas, JZMalley, MFFloyd, DM Dihydropyrimidine calcium channel blockers: 2-heterosubstituted 4-aryl-1,4-dihydro-6-methyl-5-pyrimidinecarboxylic acid esters as potent mimics of dihydropyridines. J Med Chem33:1510-5 (1990) Voltage-dependent L-type calcium channel subunit alpha-1C
Name:Voltage-dependent L-type calcium channel subunit alpha-1C
Type:Enzyme Catalytic Domain
Mol. Mass.:248979.79
Organism:Homo sapiens (Human)
Description:Calcium channel (Type L) 0 HUMAN::Q13936
Residue:2221
BDBM50226804
NameBDBM50226804
Synonyms:CHEMBL88149
TypeSmall organic molecule
Emp. Form.C15H17N3O5
Mol. Mass.319.3126
SMILESCCOC(=O)C1=C(C)N=C(NC1c1cccc(c1)[N+]([O-])=O)OC