Reaction Details
TargetMu-type opioid receptor
LigandBDBM50013622
Substrate/Competitorn/a
Meas. Tech.ChEBML_145286
Ki 16±n/a nM
Citation Portoghese, PSSultana, MTakemori, AE Design of peptidomimetic delta opioid receptor antagonists using the message-address concept. J Med Chem33:1714-20 (1990) Mu-type opioid receptor
Name:Mu-type opioid receptor
Type:Enzyme Catalytic Domain
Mol. Mass.:11165.58
Organism:GUINEA PIG
Description:P97266
Residue:98
BDBM50013622
NameBDBM50013622
Synonyms:9-methyloxy-22-cyclopropylmethyl-(2S,13R)-14-oxa-11,22-diazaheptacyclo[13.9.1.01,13.02,21.04,12.05,10.019,25]pentacosa-4(12),5(10),6,8,15(25),16,18-heptaene-2,16-diol(HCl1.5H2O)
TypeSmall organic molecule
Emp. Form.C27H28N2O4
Mol. Mass.444.5222
SMILESCOc1cccc2c3C[C@@]4(O)C5Cc6ccc(O)c7O[C@@H](c3[nH]c12)[C@]4(CCN5CC1CC1)c67