Reaction Details
TargetDelta-type opioid receptor
LigandBDBM50013626
Substrate/Competitorn/a
Meas. Tech.ChEMBL_147154 (CHEMBL758179)
Ki 14±n/a nM
Citation Portoghese, PSSultana, MTakemori, AE Design of peptidomimetic delta opioid receptor antagonists using the message-address concept. J Med Chem33:1714-20 (1990) Delta-type opioid receptor
Name:Delta-type opioid receptor
Type:G Protein-Coupled Receptor (GPCR)
Mol. Mass.:40382.98
Organism:Homo sapiens (Human)
Description:Competition binding assays were carried out using membrane preparations from transfected HN9.10 cells that constitutively expressed the delta opioid receptor.
Residue:372
BDBM50013626
NameBDBM50013626
Synonyms:2-{2-[2-{2-[2-(2-Amino-3-phenyl-propionylamino)-3-hydroxy-propionylamino]-acetylamino}-3-(4-hydroxy-phenyl)-propionylamino]-4-methyl-pentanoylamino}-3-hydroxy-butyric acid (DSLET) | CHEMBL47029
TypeSmall organic molecule
Emp. Form.C33H46N6O10
Mol. Mass.686.7525
SMILESCC(C)C[C@H](NC(=O)[C@H](Cc1ccc(O)cc1)NC(=O)CNC(=O)[C@H](CO)NC(=O)[C@@H](N)Cc1ccccc1)C(=O)N[C@@H]([C@@H](C)O)C(O)=O