Reaction Details
TargetMuscarinic acetylcholine receptor M1
LigandBDBM50452855
Substrate/Competitorn/a
Meas. Tech.ChEBML_138933
Kd 0.750000±n/a nM
Citation Cereda, EEzhaya, AGil Quintero, MBellora, EDubini, EMicheletti, RSchiavone, ABrambilla, ASchiavi, GBDonetti, A Synthesis and biological evaluation of new antimuscarinic compounds with amidine basic centers. A useful bioisosteric replacement of classical cationic heads. J Med Chem33:2108-13 (1990) Muscarinic acetylcholine receptor M1
Name:Muscarinic acetylcholine receptor M1
Type:Enzyme Catalytic Domain
Mol. Mass.:51390.46
Organism:RAT
Description:P08482
Residue:460
BDBM50452855
NameBDBM50452855
Synonyms:Isoptpo Hyoscine | Scopolamine
TypeSmall organic molecule
Emp. Form.C17H21NO4
Mol. Mass.303.3529
SMILES[H][C@@]12O[C@@]1([H])[C@]1([H])C[C@@H](C[C@@]2([H])N1C)OC(=O)[C@H](CO)c1ccccc1